Target
D(2) dopamine receptor
Ligand
BDBM50010289
Substrate
Meas. Tech.
ChEMBL_59152 (CHEMBL671033)
Ki
13±n/a nM
Citation
 Bakthavachalam, VBaindur, NMadras, BKNeumeyer, JL Fluorescent probes for dopamine receptors: synthesis and characterization of fluorescein and 7-nitrobenz-2-oxa-1,3-diazol-4-yl conjugates of D-1 and D-2 receptor ligands. J Med Chem 34:3235-41 (1991)  
Target
Name:
D(2) dopamine receptor
Synonyms:
D(2) dopamine receptor DOPAMINE D2 Long DRD2 Dopamine D2 receptor Dopamine D2 receptor (D2R) Dopamine2-like | d2
Type:
Cell-surface receptors
Mol. Mass.:
50647.10
Organism:
Homo sapiens (Human)
Description:
P14416
Residue:
443
  
Inhibitor
Name:
BDBM50010289
Synonyms:
(R)6-(Phenethyl-propyl-amino)-5,6,7,8-tetrahydro-naphthalen-1-ol (S)6-(Phenethyl-propyl-amino)-5,6,7,8-tetrahydro-naphthalen-1-ol CHEMBL109684 | N-0434
Type:
Small organic molecule
Emp. Form.:
C21H27NO
Mol. Mass.:
309.4452
SMILES:
CCCN(CCc1ccccc1)C1CCc2c(O)cccc2C1
: