Target
Cathepsin D
Ligand
BDBM50010412
Substrate
Meas. Tech.
ChEBML_216563
IC50
8800±n/a nM
Citation
 Raddatz, PJonczyk, AMinck, KOSchmitges, CJSombroek, J Substrate analogue renin inhibitors containing replacements of histidine in P2 or isosteres of the amide bond between P3 and P2 sites. J Med Chem 34:3267-80 (1991)  
Target
Name:
Cathepsin D
Synonyms:
CATD_BOVIN | CTSD
Type:
PROTEIN
Mol. Mass.:
42158.92
Organism:
Bos taurus
Description:
ChEMBL_1458606
Residue:
387
  
Inhibitor
Name:
BDBM50010412
Synonyms:
BOC-Phe-psi[COCH2S]Gly-Leu-psi-[CHOHCH2]Val-Ile N-[(4-amino-2-methyl-5-pyrimidinyl)methyl]amide | CHEMBL324213
Type:
Small organic molecule
Emp. Form.:
C41H65N7O7S
Mol. Mass.:
800.063
SMILES:
CC[C@H](C)[C@H](NC(=O)[C@@H](C[C@H](O)[C@H](CC(C)C)NC(=O)CSCC(=O)[C@H](Cc1ccccc1)NC(=O)OC(C)(C)C)C(C)C)C(=O)NCc1cnc(C)nc1N
: