Target
Gag-Pol polyprotein [489-587]
Ligand
BDBM50229036
Substrate
Meas. Tech.
ChEMBL_160732 (CHEMBL878991)
IC50
<2.7±n/a nM
Citation
 Krohn, ARedshaw, SRitchie, JCGraves, BJHatada, MH Novel binding mode of highly potent HIV-proteinase inhibitors incorporating the (R)-hydroxyethylamine isostere. J Med Chem 34:3340-2 (1991)  
Target
Name:
Gag-Pol polyprotein [489-587]
Synonyms:
Human immunodeficiency virus type 1 protease Pol polyprotein | gag-pol
Type:
Enzyme Subunit
Mol. Mass.:
10781.16
Organism:
Human immunodeficiency virus type 1
Description:
P04585[489-587]
Residue:
99
  
Inhibitor
Name:
BDBM50229036
Synonyms:
CHEMBL323014
Type:
Small organic molecule
Emp. Form.:
C36H51N5O6
Mol. Mass.:
649.82
SMILES:
CC(C)(C)NC(=O)C1CC2CCCCC2CN1C[C@@H](O)[C@H](Cc1ccccc1)NC(=O)[C@H](CC(N)=O)NC(=O)OCc1ccccc1
: