Target
5-hydroxytryptamine receptor 1A
Ligand
BDBM50007489
Substrate
Meas. Tech.
ChEBML_847
IC50
2760±n/a nM
Citation
 Hrib, NJJurcak, JGHuger, FPErrico, CLDunn, RW Synthesis and biological evaluation of a series of substituted N-alkoxyimides and -amides as potential atypical antipsychotic agents. J Med Chem 34:1068-72 (1991)  
Target
Name:
5-hydroxytryptamine receptor 1A
Synonyms:
5-HT-1A 5-HT1A 5-hydroxytryptamine receptor 1A (5HT1A) 5ht1a Htr1a Serotonin 1a (5-HT1a) receptor/Adrenergic receptor alpha-1 | Serotonin receptor 1A
Type:
G Protein-Coupled Receptor (GPCR)
Mol. Mass.:
46445.29
Organism:
Rattus norvegicus (rat)
Description:
Binding assays were performed using rat hippocampal membranes.
Residue:
422
  
Inhibitor
Name:
BDBM50007489
Synonyms:
8-[2-(4-Pyrimidin-2-yl-piperazin-1-yl)-ethoxy]-8-aza-spiro[4.5]decane-7,9-dione | CHEMBL273505
Type:
Small organic molecule
Emp. Form.:
C19H27N5O3
Mol. Mass.:
373.4494
SMILES:
O=C1CC2(CCCC2)CC(=O)N1OCCN1CCN(CC1)c1ncccn1
: