Target
Prostaglandin-H2 D-isomerase
Ligand
BDBM50368234
Substrate
Meas. Tech.
ChEBML_158157
IC50
9000±n/a nM
Citation
 Bell, MRD'Ambra, TEKumar, VEissenstat, MAHerrmann, JLWetzel, JRRosi, DPhilion, REDaum, SJHlasta, DJ Antinociceptive (aminoalkyl)indoles. J Med Chem 34:1099-110 (1991)  
Target
Name:
Prostaglandin-H2 D-isomerase
Synonyms:
PTGDS_MOUSE | Ptgds
Type:
PROTEIN
Mol. Mass.:
21069.88
Organism:
Mus musculus
Description:
ChEMBL_158158
Residue:
189
  
Inhibitor
Name:
BDBM50368234
Synonyms:
CHEMBL1907835
Type:
Small organic molecule
Emp. Form.:
C22H23FN2O2
Mol. Mass.:
366.4286
SMILES:
C[C@H](CN1CCOCC1)n1cc(C(=O)c2ccccc2F)c2ccccc12
: