Target
Adenosine receptor A2a/A2b
Ligand
BDBM50011597
Substrate
Meas. Tech.
ChEMBL_30709 (CHEMBL645452)
Ki
290±n/a nM
Citation
 van Galen, PJNissen, Pvan Wijngaarden, IIJzerman, APSoudijn, W 1H-imidazo[4,5-c]quinolin-4-amines: novel non-xanthine adenosine antagonists. J Med Chem 34:1202-6 (1991)  
Target
Name:
Adenosine receptor A2a/A2b
Synonyms:
Adenosine A2 receptor
Type:
Mol. Mass.:
Description:
ASSAY_ID of ChEMBL is 30560
Components:
This complex has 2 components.
Component 1
Name:
Adenosine receptor A2b
Synonyms:
AA2BR_RAT Adora2b
Type:
PROTEIN
Mol. Mass.:
36378.84
Organism:
Rattus norvegicus
Description:
ChEMBL_32934
Residue:
332
  
Component 2
Name:
Adenosine receptor A2a
Synonyms:
AA2AR_RAT Adenosine A2 receptor Adenosine Receptors A2a (A2a) Adenosine receptors A2a Rat striatal adenosine A2a receptor
Type:
G Protein-Coupled Receptor (GPCR)
Mol. Mass.:
45015.65
Organism:
Rattus norvegicus (rat)
Description:
Rat A2A receptors expressed in CHO cells.
Residue:
410
  
Inhibitor
Name:
BDBM50011597
Synonyms:
2-Phenyl-1H-imidazo[4,5-c]quinolin-4-ylamine | CHEMBL276138
Type:
Small organic molecule
Emp. Form.:
C16H12N4
Mol. Mass.:
260.2933
SMILES:
Nc1nc2ccccc2c2nc([nH]c12)-c1ccccc1
: