Target
Adenosine receptor A1
Ligand
BDBM50011594
Substrate
Meas. Tech.
ChEBML_28960
Ki
50±n/a nM
Citation
 van Galen, PJNissen, Pvan Wijngaarden, IIJzerman, APSoudijn, W 1H-imidazo[4,5-c]quinolin-4-amines: novel non-xanthine adenosine antagonists. J Med Chem 34:1202-6 (1991)  
Target
Name:
Adenosine receptor A1
Synonyms:
AA1R_BOVIN ADENOSINE A1 high ADORA1 | Adenosine A1 receptor
Type:
Enzyme Catalytic Domain
Mol. Mass.:
36602.99
Organism:
BOVINE
Description:
ADENOSINE 0 BOVINE::P28190
Residue:
326
  
Inhibitor
Name:
BDBM50011594
Synonyms:
CHEMBL441954 | Phenyl-(2-phenyl-1H-imidazo[4,5-c]quinolin-4-yl)-amine
Type:
Small organic molecule
Emp. Form.:
C22H16N4
Mol. Mass.:
336.3892
SMILES:
N(c1ccccc1)c1nc2ccccc2c2nc([nH]c12)-c1ccccc1
: