Target
Cathepsin E
Ligand
BDBM50368240
Substrate
Meas. Tech.
ChEBML_45331
IC50
>10000±n/a nM
Citation
 Williams, PDPerlow, DSPayne, LSHolloway, MKSiegl, PKSchorn, TWLynch, RJDoyle, JJStrouse, JFVlasuk, GP Renin inhibitors containing conformationally restricted P1-P1' dipeptide mimetics. J Med Chem 34:887-900 (1991)  
Target
Name:
Cathepsin E
Synonyms:
3.4.23.34 CTSE Cathepsin E form II
Type:
Enzyme
Mol. Mass.:
43298.99
Organism:
Homo sapiens (Human)
Description:
P14091
Residue:
396
  
Inhibitor
Name:
BDBM50368240
Synonyms:
CHEMBL1169538
Type:
Small organic molecule
Emp. Form.:
C34H50N6O6
Mol. Mass.:
638.7974
SMILES:
CN1CC[C@H]([C@H](O)[C@H](CC2CCCCC2)NC(=O)[C@H](Cc2cnc[nH]2)NC(=O)[C@H](Cc2ccccc2)NC(=O)OC(C)(C)C)C1=O
: