Target
Pepsin A
Ligand
BDBM50368240
Substrate
Meas. Tech.
ChEBML_153854
IC50
1000±n/a nM
Citation
 Williams, PDPerlow, DSPayne, LSHolloway, MKSiegl, PKSchorn, TWLynch, RJDoyle, JJStrouse, JFVlasuk, GP Renin inhibitors containing conformationally restricted P1-P1' dipeptide mimetics. J Med Chem 34:887-900 (1991)  
Target
Name:
Pepsin A
Synonyms:
PEPA_PIG Pepsin | Pepsin A precursor
Type:
Enzyme
Mol. Mass.:
41232.87
Organism:
Porcine
Description:
Residue:
385
  
Inhibitor
Name:
BDBM50368240
Synonyms:
CHEMBL1169538
Type:
Small organic molecule
Emp. Form.:
C34H50N6O6
Mol. Mass.:
638.7974
SMILES:
CN1CC[C@H]([C@H](O)[C@H](CC2CCCCC2)NC(=O)[C@H](Cc2cnc[nH]2)NC(=O)[C@H](Cc2ccccc2)NC(=O)OC(C)(C)C)C1=O
: