Target
Adenosine receptor A1
Ligand
BDBM50368253
Substrate
Meas. Tech.
ChEMBL_29276 (CHEMBL640337)
EC50
4.467E3±n/a nM
Citation
 Ueeda, MThompson, RDArroyo, LHOlsson, RA 2-Alkoxyadenosines: potent and selective agonists at the coronary artery A2 adenosine receptor. J Med Chem 34:1334-9 (1991)  
Target
Name:
Adenosine receptor A1
Synonyms:
A1 adenosine receptor ADENOSINE A1 ADENOSINE A1 low Adenosine A1 receptor | Adenosine Receptor A1
Type:
Enzyme Catalytic Domain
Mol. Mass.:
36501.39
Organism:
GUINEA PIG
Description:
ADENOSINE A1 ADORA1 GUINEA PIG::P47745
Residue:
326
  
Inhibitor
Name:
BDBM50368253
Synonyms:
CHEMBL603373
Type:
Small organic molecule
Emp. Form.:
C22H31N5O6
Mol. Mass.:
461.5114
SMILES:
CC1(C)C2CC1C(CC2)C(=O)CCOc1nc(N)c2ncn(C3O[C@@H](CO)[C@H](O)[C@@H]3O)c2n1
: