Target
Mu-type opioid receptor
Ligand
BDBM50009138
Substrate
Meas. Tech.
ChEBML_149005
Ki
3221±n/a nM
Citation
 Lazarus, LHSalvadori, SSantagada, VTomatis, RWilson, WE Function of negative charge in the"address domain" of deltorphins. J Med Chem 34:1350-5 (1991)  
Target
Name:
Mu-type opioid receptor
Synonyms:
MOR-1 Mu-type opioid receptor (MOR) OPRM_RAT Opioid receptor B Ror-b
Type:
G Protein-Coupled Receptor (GPCR)
Mol. Mass.:
44503.11
Organism:
Rattus norvegicus (rat)
Description:
Competition binding assays were carried out using membrane preparations from transfected HN9.10 cells that constitutively expressed the mu opioid receptor.
Residue:
398
  
Inhibitor
Name:
BDBM50009138
Synonyms:
3-(2-{2-[2-(2-{2-[2-Amino-3-(4-hydroxy-phenyl)-propionylamino]-4-methylsulfanyl-butyrylamino}-3-phenyl-propionylamino)-3-(3H-imidazol-4-yl)-propionylamino]-4-methyl-pentanoylamino}-4-methylsulfanyl-butyrylamino)-4-oxo-pentanoic acid | CHEMBL26632
Type:
Small organic molecule
Emp. Form.:
C45H63N9O10S2
Mol. Mass.:
954.166
SMILES:
CSCC[C@@H](NC(=O)[C@@H](N)Cc1ccc(O)cc1)C(=O)N[C@@H](Cc1ccccc1)C(=O)N[C@@H](Cc1cnc[nH]1)C(=O)N[C@@H](CC(C)C)C(=O)N[C@@H](CCSC)C(=O)N[C@@H](CC(O)=O)C(C)=O
: