Target
Muscarinic acetylcholine receptor M2
Ligand
BDBM50403547
Substrate
Meas. Tech.
ChEMBL_138564 (CHEMBL745519)
Ki
0.344000±n/a nM
Citation
 Carroll, FIAbraham, PMascarella, SWSingh, PMoreland, CGSankar, SSKwon, YWTriggle, DJ Crystal, solution, and molecular modeling structural properties and muscarinic antagonist activity of azaprophen. J Med Chem 34:1436-40 (1991)  
Target
Name:
Muscarinic acetylcholine receptor M2
Synonyms:
ACM2_HUMAN Cholinergic, muscarinic M2 Muscarinic acetylcholine receptor M2 and M5 | RecName: Full=Muscarinic acetylcholine receptor M2
Type:
GPCR
Mol. Mass.:
51730.61
Organism:
Homo sapiens (Human)
Description:
P08172
Residue:
466
  
Inhibitor
Name:
BDBM50403547
Synonyms:
ATROPEN | ATROPINE
Type:
Small organic molecule
Emp. Form.:
C17H23NO3
Mol. Mass.:
289.3694
SMILES:
CN1[C@H]2CC[C@@H]1C[C@@H](C2)OC(=O)C(CO)c1ccccc1
: