Target
Delta-type opioid receptor
Ligand
BDBM50006946
Substrate
Meas. Tech.
ChEMBL_147157 (CHEMBL758768)
Ki
35±n/a nM
Citation
 Portoghese, PS An approach to the design of receptor-type-selective non-peptide antagonists of peptidergic receptors: delta opioid antagonists. J Med Chem 34:1757-62 (1991)  
Target
Name:
Delta-type opioid receptor
Synonyms:
D-OR-1 Delta opioid receptor OPIATE Delta OPRD1 OPRK1 | opioid receptor, delta 1
Type:
G Protein-Coupled Receptor (GPCR)
Mol. Mass.:
40382.98
Organism:
Homo sapiens (Human)
Description:
Competition binding assays were carried out using membrane preparations from transfected HN9.10 cells that constitutively expressed the delta opioid receptor.
Residue:
372
  
Inhibitor
Name:
BDBM50006946
Synonyms:
2-[2-(2-{2-[2-Diallylamino-3-(4-hydroxy-phenyl)-propionylamino]-2-methyl-propionylamino}-2-methyl-propionylamino)-3-phenyl-propionylamino]-4-methyl-pentanoic acid ICI-174864
Type:
Small organic molecule
Emp. Form.:
C38H53N5O7
Mol. Mass.:
691.8567
SMILES:
CC(C)C[C@H](NC(=O)[C@H](Cc1ccccc1)NC(=O)C(C)(C)NC(=O)C(C)(C)NC(=O)[C@H](Cc1ccc(O)cc1)N(CC=C)CC=C)C(O)=O
: