Target
Carbonic anhydrase 2
Ligand
BDBM50012220
Substrate
Meas. Tech.
ChEMBL_45238 (CHEMBL658941)
Ki
2.70±n/a nM
Citation
 Prugh, JDHartman, GDMallorga, PJMcKeever, BMMichelson, SRMurcko, MASchwam, HSmith, RLSondey, JMSpringer, JP New isomeric classes of topically active ocular hypotensive carbonic anhydrase inhibitors: 5-substituted thieno[2,3-b]thiophene-2-sulfonamides and 5-substituted thieno[3,2-b]thiophene-2-sulfonamides. J Med Chem 34:1805-18 (1991)  
Target
Name:
Carbonic anhydrase 2
Synonyms:
CA-II CAC Carbonate dehydratase II Carbonic anhydrase 2 (CA-II) Carbonic anhydrase C Carbonic anhydrase II (CA-II) Carbonic anhydrase II (hCA II) | Carbonic anhydrase isoenzyme II (hCA II)
Type:
Enzyme
Mol. Mass.:
29250.71
Organism:
Homo sapiens (Human)
Description:
P00918
Residue:
260
  
Inhibitor
Name:
BDBM50012220
Synonyms:
5-(Isobutylamino-methyl)-thieno[3,2-b]thiophene-2-sulfonic acid amide; hydrochloride | CHEMBL543792
Type:
Small organic molecule
Emp. Form.:
C11H16N2O2S3
Mol. Mass.:
304.452
SMILES:
CC(C)CNCc1cc2sc(cc2s1)S(N)(=O)=O
: