Target
D(1A) dopamine receptor
Ligand
BDBM50006968
Substrate
Meas. Tech.
ChEMBL_58185 (CHEMBL669840)
IC50
>10000±n/a nM
Citation
 Glennon, RAIsmaiel, AMSmith, JDYousif, Mel-Ashmawy, MHerndon, JLFischer, JBHowie, KJServer, AC Binding of substituted and conformationally restricted derivatives of N-(3-phenyl-n-propyl)-1-phenyl-2-aminopropane at sigma-receptors. J Med Chem 34:1855-9 (1991)  
Target
Name:
D(1A) dopamine receptor
Synonyms:
DOPAMINE D1 Dopamine D1 high Dopamine receptor Dopamine1-like Drd1a
Type:
Enzyme Catalytic Domain
Mol. Mass.:
49429.75
Organism:
RAT
Description:
P18901
Residue:
446
  
Inhibitor
Name:
BDBM50006968
Synonyms:
(3-Phenyl-propyl)-(6,7,8,9-tetrahydro-5H-benzocyclohepten-7-yl)-amine | CHEMBL296601
Type:
Small organic molecule
Emp. Form.:
C20H25N
Mol. Mass.:
279.4192
SMILES:
C(CNC1CCc2ccccc2CC1)Cc1ccccc1
: