Target
Sigma non-opioid intracellular receptor 1
Ligand
BDBM50006979
Substrate
Meas. Tech.
ChEMBL_201278 (CHEMBL804967)
Ki
83±n/a nM
Citation
 Glennon, RAIsmaiel, AMSmith, JDYousif, Mel-Ashmawy, MHerndon, JLFischer, JBHowie, KJServer, AC Binding of substituted and conformationally restricted derivatives of N-(3-phenyl-n-propyl)-1-phenyl-2-aminopropane at sigma-receptors. J Med Chem 34:1855-9 (1991)  
Target
Name:
Sigma non-opioid intracellular receptor 1
Synonyms:
Aging-associated gene 8 protein SGMR1_HUMAN SIGMAR1 SR31747-binding protein Sigma 1-type opioid receptor Sigma1R | hSigmaR1
Type:
Enzyme Catalytic Domain
Mol. Mass.:
25124.85
Organism:
Homo sapiens (Human)
Description:
Q99720
Residue:
223
  
Inhibitor
Name:
BDBM50006979
Synonyms:
(3-Phenyl-propyl)-(6,7,8,9-tetrahydro-5H-benzocyclohepten-6-yl)-amine | CHEMBL55318
Type:
Small organic molecule
Emp. Form.:
C20H25N
Mol. Mass.:
279.4192
SMILES:
C(CNC1CCCc2ccccc2C1)Cc1ccccc1
: