Target
D(1A) dopamine receptor
Ligand
BDBM50006967
Substrate
Meas. Tech.
ChEMBL_58185 (CHEMBL669840)
IC50
>10000±n/a nM
Citation
 Glennon, RAIsmaiel, AMSmith, JDYousif, Mel-Ashmawy, MHerndon, JLFischer, JBHowie, KJServer, AC Binding of substituted and conformationally restricted derivatives of N-(3-phenyl-n-propyl)-1-phenyl-2-aminopropane at sigma-receptors. J Med Chem 34:1855-9 (1991)  
Target
Name:
D(1A) dopamine receptor
Synonyms:
DOPAMINE D1 Dopamine D1 high Dopamine receptor Dopamine1-like Drd1a
Type:
Enzyme Catalytic Domain
Mol. Mass.:
49429.75
Organism:
RAT
Description:
P18901
Residue:
446
  
Inhibitor
Name:
BDBM50006967
Synonyms:
CHEMBL53170 | [2-(4-Methoxy-phenyl)-1-methyl-ethyl]-(3-phenyl-propyl)-amine
Type:
Small organic molecule
Emp. Form.:
C19H25NO
Mol. Mass.:
283.4079
SMILES:
COc1ccc(CC(C)NCCCc2ccccc2)cc1
: