Target
D(2) dopamine receptor
Ligand
BDBM50010054
Substrate
Meas. Tech.
ChEBML_61769
IC50
46±n/a nM
Citation
 Malleron, JLComte, MTGueremy, CPeyronel, JFTruchon, ABlanchard, JCDoble, APiot, OZundel, JLHuon, C Naphthosultam derivatives: a new class of potent and selective 5-HT2 antagonists. J Med Chem 34:2477-83 (1991)  
Target
Name:
D(2) dopamine receptor
Synonyms:
DOPAMINE D2 DOPAMINE D2 Short Dopamine D2 receptor Drd2
Type:
G Protein-Coupled Receptor (GPCR)
Mol. Mass.:
50931.60
Organism:
Rattus norvegicus (rat)
Description:
P61169
Residue:
444
  
Inhibitor
Name:
BDBM50010054
Synonyms:
1-{1-[3-(1,1-Dioxo-1H-1lambda*6*-naphtho[1,8-cd]isothiazol-2-yl)-propyl]-piperidin-4-yl}-1,3-dihydro-benzoimidazol-2-one | CHEMBL81813
Type:
Small organic molecule
Emp. Form.:
C25H26N4O3S
Mol. Mass.:
462.564
SMILES:
O=c1[nH]c2ccccc2n1C1CCN(CCCN2c3cccc4cccc(c34)S2(=O)=O)CC1
: