Target
D(2) dopamine receptor
Ligand
BDBM50010061
Substrate
Meas. Tech.
ChEBML_61769
IC50
300±n/a nM
Citation
 Malleron, JLComte, MTGueremy, CPeyronel, JFTruchon, ABlanchard, JCDoble, APiot, OZundel, JLHuon, C Naphthosultam derivatives: a new class of potent and selective 5-HT2 antagonists. J Med Chem 34:2477-83 (1991)  
Target
Name:
D(2) dopamine receptor
Synonyms:
DOPAMINE D2 DOPAMINE D2 Short Dopamine D2 receptor Drd2
Type:
G Protein-Coupled Receptor (GPCR)
Mol. Mass.:
50931.60
Organism:
Rattus norvegicus (rat)
Description:
P61169
Residue:
444
  
Inhibitor
Name:
BDBM50010061
Synonyms:
2-{4-[4-(4-Fluoro-phenyl)-piperazin-1-yl]-butyl}-2H-naphtho[1,8-cd]isothiazole 1,1-dioxide | CHEMBL82826
Type:
Small organic molecule
Emp. Form.:
C24H26FN3O2S
Mol. Mass.:
439.546
SMILES:
Fc1ccc(cc1)N1CCN(CCCCN2c3cccc4cccc(c34)S2(=O)=O)CC1
: