Target
Adenosine receptor A1
Ligand
BDBM50453087
Substrate
Meas. Tech.
ChEBML_28539
IC50
1862±n/a nM
Citation
 Francis, JEWebb, RLGhai, GRHutchison, AJMoskal, MAdeJesus, RYokoyama, RRovinski, SLContardo, NDotson, R Highly selective adenosine A2 receptor agonists in a series of N-alkylated 2-aminoadenosines. J Med Chem 34:2570-9 (1991)  
Target
Name:
Adenosine receptor A1
Synonyms:
AA1R_RAT ADENOSINE A1 high Adenosine A1 receptor (A1) Adenosine receptors A1 | Adora1
Type:
Protein
Mol. Mass.:
36704.13
Organism:
Rattus norvegicus (rat)
Description:
Residue:
326
  
Inhibitor
Name:
BDBM50453087
Synonyms:
CHEMBL2374394
Type:
Small organic molecule
Emp. Form.:
C19H24N6O5
Mol. Mass.:
416.4311
SMILES:
C[C@@](O)(CNc1nc(N)c2ncn([C@@H]3O[C@H](CO)[C@@H](O)[C@H]3O)c2n1)c1ccccc1
: