Target
Adenosine receptor A1
Ligand
BDBM50453083
Substrate
Meas. Tech.
ChEBML_28539
IC50
7586±n/a nM
Citation
 Francis, JEWebb, RLGhai, GRHutchison, AJMoskal, MAdeJesus, RYokoyama, RRovinski, SLContardo, NDotson, R Highly selective adenosine A2 receptor agonists in a series of N-alkylated 2-aminoadenosines. J Med Chem 34:2570-9 (1991)  
Target
Name:
Adenosine receptor A1
Synonyms:
AA1R_RAT ADENOSINE A1 high Adenosine A1 receptor (A1) Adenosine receptors A1 | Adora1
Type:
Protein
Mol. Mass.:
36704.13
Organism:
Rattus norvegicus (rat)
Description:
Residue:
326
  
Inhibitor
Name:
BDBM50453083
Synonyms:
CHEMBL2374398
Type:
Small organic molecule
Emp. Form.:
C26H28N6O4
Mol. Mass.:
488.5383
SMILES:
Nc1nc(NCCc2ccc(\C=C\c3ccccc3)cc2)nc2n(cnc12)[C@@H]1O[C@H](CO)[C@@H](O)[C@H]1O
: