Target
Protein kinase C alpha/beta/gamma type
Ligand
BDBM50229926
Substrate
Meas. Tech.
ChEBML_162244
IC50
23000±n/a nM
Citation
 Shearer, BGSullivan, JPCarter, JPMathew, RMWaid, PConnor, JRPatch, RJBurch, RM Substituted 2-(aminomethyl)piperidines: a novel class of selective protein kinase C inhibitors. J Med Chem 34:2928-31 (1991)  
Target
Name:
Protein kinase C alpha/beta/gamma type
Synonyms:
Protein kinase C, PKC; classical
Type:
Mol. Mass.:
Description:
ASSAY_ID of ChEMBL is 162381
Components:
This complex has 3 components.
Component 1
Name:
Protein kinase C alpha type
Synonyms:
KPCA_RAT Prkca Protein kinase C alpha | Protein kinase C alpha type
Type:
Protein
Mol. Mass.:
76797.67
Organism:
Rattus norvegicus (Rat)
Description:
P05696
Residue:
672
  
Component 2
Name:
Protein kinase C beta type
Synonyms:
KPCB_RAT Pkcb Prkcb1 Protein kinase C (PKC) | Protein kinase C beta
Type:
Enzyme Mixture
Mol. Mass.:
76755.54
Organism:
Rattus norvegicus (rat)
Description:
PKC from rat brain is known to contain predominately the conventional PKC isoforms, alpha, beta I, beta II, gamma.
Residue:
671
  
Component 3
Name:
Protein kinase C gamma type
Synonyms:
KPCG_RAT Pkcg Prkcg Protein kinase C gamma
Type:
PROTEIN
Mol. Mass.:
78367.88
Organism:
Rattus norvegicus
Description:
ChEMBL_152979
Residue:
697
  
Inhibitor
Name:
BDBM50229926
Synonyms:
CHEMBL319584
Type:
Small organic molecule
Emp. Form.:
C24H48N4O2
Mol. Mass.:
424.6635
SMILES:
[H][C@](N)(CCCN)C(=O)NCC1CCCCN1C(=O)CCCCCCCCCCCC
: