Target
Vasopressin V1a receptor
Ligand
BDBM50453150
Substrate
Meas. Tech.
ChEBML_214391
Kd
27±n/a nM
Citation
 Barbeau, DGuay, SNeugebauer, WEscher, E Preparation and biological activities of potential vasopressin photoaffinity labels. J Med Chem 35:151-7 (1992)  
Target
Name:
Vasopressin V1a receptor
Synonyms:
Avpr1a VASOPRESSIN V1A Vasopressin V1a receptor | Vasopressin receptor
Type:
Enzyme Catalytic Domain
Mol. Mass.:
47674.81
Organism:
RAT
Description:
VASOPRESSIN V1A AVPR1A RAT::P30560
Residue:
424
  
Inhibitor
Name:
BDBM50453150
Synonyms:
CHEMBL2372420
Type:
Small organic molecule
Emp. Form.:
C53H70N12O13S2
Mol. Mass.:
1147.326
SMILES:
CC(C)[C@@H]1NC(=O)[C@H](Cc2ccccc2)NC(=O)[C@H](Cc2ccc(cc2)[N+]([O-])=O)NC(=O)CCSSC[C@H](NC(=O)[C@H](CC(N)=O)NC1=O)C(=O)N1CCC[C@H]1C(=O)N[C@@H](CCCCN)C(=O)N[C@H](Cc1ccc(O)cc1)C(N)=O
: