Target
Renin
Ligand
BDBM50008147
Substrate
Meas. Tech.
ChEBML_192731
IC50
0.300000±n/a nM
Citation
 Doherty, AMSircar, IKornberg, BEQuin, JWinters, RTKaltenbronn, JSTaylor, MDBatley, BLRapundalo, SRRyan, MJ Design and synthesis of potent, selective, and orally active fluorine-containing renin inhibitors. J Med Chem 35:2-14 (1992)  
Target
Name:
Renin
Synonyms:
Angiotensinogenase RENI_HUMAN
Type:
Enzyme
Mol. Mass.:
45058.99
Organism:
Homo sapiens (Human)
Description:
Residue:
406
  
Inhibitor
Name:
BDBM50008147
Synonyms:
2-[3-(4-Methoxy-phenyl)-2-(morpholine-4-sulfonylamino)-propionylamino]-pent-4-enoic acid [1-cyclohexylmethyl-3,3-difluoro-3-(2-morpholin-4-yl-ethylcarbamoyl)-2-oxo-propyl]-amide; Hydrate | CHEMBL29103
Type:
Small organic molecule
Emp. Form.:
C36H54F2N6O9S
Mol. Mass.:
784.911
SMILES:
COc1ccc(C[C@H](NS(=O)(=O)N2CCOCC2)C(=O)N[C@@H](CC=C)C(=O)N[C@@H](CC2CCCCC2)C(=O)C(F)(F)C(=O)NCCN2CCOCC2)cc1
: