Target
Cathepsin D
Ligand
BDBM50008153
Substrate
Meas. Tech.
ChEBML_44987
IC50
2377±n/a nM
Citation
 Doherty, AMSircar, IKornberg, BEQuin, JWinters, RTKaltenbronn, JSTaylor, MDBatley, BLRapundalo, SRRyan, MJ Design and synthesis of potent, selective, and orally active fluorine-containing renin inhibitors. J Med Chem 35:2-14 (1992)  
Target
Name:
Cathepsin D
Synonyms:
CATD_BOVIN | CTSD
Type:
PROTEIN
Mol. Mass.:
42158.92
Organism:
Bos taurus
Description:
ChEMBL_1458606
Residue:
387
  
Inhibitor
Name:
BDBM50008153
Synonyms:
CHEMBL32575 | Morpholine-4-carboxylic acid (1-{1-[1-cyclohexylmethyl-3,3-difluoro-2-hydroxy-3-(2-morpholin-4-yl-ethylcarbamoyl)-propylcarbamoyl]-but-3-enylcarbamoyl}-2-phenyl-ethyl)-amide; Hydrate
Type:
Small organic molecule
Emp. Form.:
C36H54F2N6O7
Mol. Mass.:
720.8468
SMILES:
OC([C@H](CC1CCCCC1)NC(=O)[C@H](CC=C)NC(=O)[C@H](Cc1ccccc1)NC(=O)N1CCOCC1)C(F)(F)C(=O)NCCN1CCOCC1
: