Target
Renin
Ligand
BDBM50008155
Substrate
Meas. Tech.
ChEBML_192731
IC50
98±n/a nM
Citation
 Doherty, AMSircar, IKornberg, BEQuin, JWinters, RTKaltenbronn, JSTaylor, MDBatley, BLRapundalo, SRRyan, MJ Design and synthesis of potent, selective, and orally active fluorine-containing renin inhibitors. J Med Chem 35:2-14 (1992)  
Target
Name:
Renin
Synonyms:
Angiotensinogenase RENI_HUMAN
Type:
Enzyme
Mol. Mass.:
45058.99
Organism:
Homo sapiens (Human)
Description:
Residue:
406
  
Inhibitor
Name:
BDBM50008155
Synonyms:
2-[3-Hydroxy-2-(morpholine-4-sulfonylamino)-3-phenyl-propionylamino]-pent-4-enoic acid [1-cyclohexylmethyl-3,3-difluoro-2-hydroxy-3-(2-morpholin-4-yl-ethylcarbamoyl)-propyl]-amide; Hydrate | CHEMBL32046
Type:
Small organic molecule
Emp. Form.:
C35H54F2N6O9S
Mol. Mass.:
772.9
SMILES:
OC([C@H](NS(=O)(=O)N1CCOCC1)C(=O)N[C@@H](CC=C)C(=O)N[C@@H](CC1CCCCC1)C(O)C(F)(F)C(=O)NCCN1CCOCC1)c1ccccc1
: