Target
Gastrin/cholecystokinin type B receptor
Ligand
BDBM50008192
Substrate
Meas. Tech.
ChEBML_216728
IC50
800±n/a nM
Citation
 Makovec, FPeris, WRevel, LGiovanetti, RMennuni, LRovati, LC Structure-antigastrin activity relationships of new (R)-4-benzamido-5-oxopentanoic acid derivatives. J Med Chem 35:28-38 (1992)  
Target
Name:
Gastrin/cholecystokinin type B receptor
Synonyms:
Cckbr Cholecystokinin B receptor GASR_RAT | Gastrin/cholecystokinin type B receptor
Type:
Enzyme Catalytic Domain
Mol. Mass.:
48980.43
Organism:
RAT
Description:
Cholecystokinin A CCKBR RAT::P30553
Residue:
452
  
Inhibitor
Name:
BDBM50008192
Synonyms:
4-(8-Aza-spiro[4.5]dec-8-ylcarbamoyl)-4-(2,3-dichloro-benzoylamino)-butyric acid | CHEMBL421474
Type:
Small organic molecule
Emp. Form.:
C21H27Cl2N3O4
Mol. Mass.:
456.363
SMILES:
OC(=O)CCC(NC(=O)c1cccc(Cl)c1Cl)C(=O)NN1CCC2(CCCC2)CC1
: