Target
Cholecystokinin receptor type A
Ligand
BDBM50008208
Substrate
Meas. Tech.
ChEBML_50058
IC50
27300±n/a nM
Citation
 Makovec, FPeris, WRevel, LGiovanetti, RMennuni, LRovati, LC Structure-antigastrin activity relationships of new (R)-4-benzamido-5-oxopentanoic acid derivatives. J Med Chem 35:28-38 (1992)  
Target
Name:
Cholecystokinin receptor type A
Synonyms:
CCKAR_RAT Cholecystokinin peripheral Cholecystokinin receptor type A
Type:
Enzyme Catalytic Domain
Mol. Mass.:
49676.37
Organism:
RAT
Description:
Cholecystokinin central 0 RAT::P30551
Residue:
444
  
Inhibitor
Name:
BDBM50008208
Synonyms:
4-(3,5-Dichloro-benzoylamino)-4-(spiro[5.5]undec-3-ylcarbamoyl)-butyric acid | CHEMBL124805
Type:
Small organic molecule
Emp. Form.:
C23H30Cl2N2O4
Mol. Mass.:
469.401
SMILES:
OC(=O)CCC(NC(=O)c1cc(Cl)cc(Cl)c1)C(=O)NC1CCC2(CCCCC2)CC1
: