Target
Gastrin/cholecystokinin type B receptor
Ligand
BDBM50008170
Substrate
Meas. Tech.
ChEBML_216728
IC50
3000±n/a nM
Citation
 Makovec, FPeris, WRevel, LGiovanetti, RMennuni, LRovati, LC Structure-antigastrin activity relationships of new (R)-4-benzamido-5-oxopentanoic acid derivatives. J Med Chem 35:28-38 (1992)  
Target
Name:
Gastrin/cholecystokinin type B receptor
Synonyms:
Cckbr Cholecystokinin B receptor GASR_RAT | Gastrin/cholecystokinin type B receptor
Type:
Enzyme Catalytic Domain
Mol. Mass.:
48980.43
Organism:
RAT
Description:
Cholecystokinin A CCKBR RAT::P30553
Residue:
452
  
Inhibitor
Name:
BDBM50008170
Synonyms:
4-(3,4-Dichloro-benzoylamino)-4-dipentylcarbamoyl-butyric acid Lorglumide
Type:
Small organic molecule
Emp. Form.:
C22H32Cl2N2O4
Mol. Mass.:
459.406
SMILES:
CCCCCN(CCCCC)C(=O)C(CCC(O)=O)NC(=O)c1ccc(Cl)c(Cl)c1
: