Target
Sodium-dependent dopamine transporter
Ligand
BDBM50005567
Substrate
Meas. Tech.
ChEBML_61999
IC50
227±n/a nM
Citation
 Carroll, FIGao, YAbraham, PLewin, AHLew, RPatel, ABoja, JWKuhar, MJ Probes for the cocaine receptor. Potentially irreversible ligands for the dopamine transporter. J Med Chem 35:1813-7 (1992)  
Target
Name:
Sodium-dependent dopamine transporter
Synonyms:
DA transporter SC6A3_RAT Sodium-dependent dopamine transporter | Sodium-dependent dopamine transporter (DAT)
Type:
Multi-pass membrane protein
Mol. Mass.:
68749.45
Organism:
Rattus norvegicus (rat)
Description:
P23977
Residue:
619
  
Inhibitor
Name:
BDBM50005567
Synonyms:
3-Benzoyloxy-8-methyl-8-aza-bicyclo[3.2.1]octane-2-carboxylic acid 2-(4-azido-phenyl)-ethyl ester | CHEMBL178269
Type:
Small organic molecule
Emp. Form.:
C24H26N4O4
Mol. Mass.:
434.4876
SMILES:
CN1[C@@H]2CCC1C([C@H](C2)OC(=O)c1ccccc1)C(=O)OCCc1ccc(cc1)N=[N+]=[N-]
: