Target
Histamine H1 receptor
Ligand
BDBM50002085
Substrate
Meas. Tech.
ChEBML_83429
Ki
4.6±n/a nM
Citation
 Ohshima, EOtaki, SSato, HKumazawa, TObase, HIshii, AIshii, HOhmori, KHirayama, N Synthesis and antiallergic activity of 11-(aminoalkylidene)-6,11-dihydrodibenz[b,e]oxepin derivatives. J Med Chem 35:2074-84 (1992)  
Target
Name:
Histamine H1 receptor
Synonyms:
HISTAMINE H1 HRH1_CAVPO
Type:
G Protein-Coupled Receptor (GPCR)
Mol. Mass.:
55641.53
Organism:
Cavia porcellus (domestic guinea pig)
Description:
Guinea pig cerebellum was used in binding assay.
Residue:
488
  
Inhibitor
Name:
BDBM50002085
Synonyms:
CHEMBL304185 | [11-(4-Dimethylamino-butylidene)-6,11-dihydro-dibenzo[b,e]oxepin-2-yl]-acetic acid
Type:
Small organic molecule
Emp. Form.:
C22H25NO3
Mol. Mass.:
351.4388
SMILES:
CN(C)CCC\C=C1\c2ccccc2COc2ccc(CC(O)=O)cc12
: