Target
Histamine H1 receptor
Ligand
BDBM50002092
Substrate
Meas. Tech.
ChEBML_83429
Ki
7.6±n/a nM
Citation
 Ohshima, EOtaki, SSato, HKumazawa, TObase, HIshii, AIshii, HOhmori, KHirayama, N Synthesis and antiallergic activity of 11-(aminoalkylidene)-6,11-dihydrodibenz[b,e]oxepin derivatives. J Med Chem 35:2074-84 (1992)  
Target
Name:
Histamine H1 receptor
Synonyms:
HISTAMINE H1 HRH1_CAVPO
Type:
G Protein-Coupled Receptor (GPCR)
Mol. Mass.:
55641.53
Organism:
Cavia porcellus (domestic guinea pig)
Description:
Guinea pig cerebellum was used in binding assay.
Residue:
488
  
Inhibitor
Name:
BDBM50002092
Synonyms:
11-(3-Thiomorpholin-4-yl-propylidene)-6,11-dihydro-dibenzo[b,e]oxepine-2-carboxylic acid | CHEMBL65492
Type:
Small organic molecule
Emp. Form.:
C22H23NO3S
Mol. Mass.:
381.488
SMILES:
OC(=O)c1ccc2OCc3ccccc3\C(=C\CCN3CCSCC3)c2c1
: