Target
3-hydroxy-3-methylglutaryl-coenzyme A reductase
Ligand
BDBM50006407
Substrate
Meas. Tech.
ChEBML_80349
IC50
7±n/a nM
Citation
 Sliskovic, DRBlankley, CJKrause, BRNewton, RSPicard, JARoark, WHRoth, BDSekerke, CShaw, MKStanfield, RL Inhibitors of cholesterol biosynthesis. 6. trans-6-[2-(2-N-heteroaryl-3,5-disubstituted- pyrazol-4-yl)ethyl/ethenyl]tetrahydro-4-hydroxy-2H-pyran-2-ones. J Med Chem 35:2095-103 (1992)  
Target
Name:
3-hydroxy-3-methylglutaryl-coenzyme A reductase
Synonyms:
3-hydroxy-3-methylglutaryl-coenzyme A (HMG-CoA) reductase HMDH_HUMAN HMG-CoA reductase (HMGR) | HMGCR
Type:
Enzyme
Mol. Mass.:
97477.10
Organism:
Homo sapiens (Human)
Description:
P04035
Residue:
888
  
Inhibitor
Name:
BDBM50006407
Synonyms:
CHEMBL2367472 | Sodium; 7-[5-(4-fluoro-phenyl)-3-isopropyl-1-pyrazin-2-yl-1H-pyrazol-4-yl]-3,5-dihydroxy-hept-6-enoate
Type:
Small organic molecule
Emp. Form.:
C23H24FN4NaO4
Mol. Mass.:
462.4492
SMILES:
[Na+].CC(C)c1nn(c(c1\C=C\[C@@H](O)C[C@@H](O)CC([O-])=O)-c1ccc(F)cc1)-c1cnccn1
: