Target
Adenosine receptor A1
Ligand
BDBM50368343
Substrate
Meas. Tech.
ChEBML_28837
Ki
16±n/a nM
Citation
 Abiru, TMiyashita, TWatanabe, YYamaguchi, TMachida, HMatsuda, A Nucleosides and nucleotides. 107. 2-(cycloalkylalkynyl)adenosines: adenosine A2 receptor agonists with potent antihypertensive effects. J Med Chem 35:2253-60 (1992)  
Target
Name:
Adenosine receptor A1
Synonyms:
AA1R_RAT ADENOSINE A1 high Adenosine A1 receptor (A1) Adenosine receptors A1 | Adora1
Type:
Protein
Mol. Mass.:
36704.13
Organism:
Rattus norvegicus (rat)
Description:
Residue:
326
  
Inhibitor
Name:
BDBM50368343
Synonyms:
CHEMBL608594
Type:
Small organic molecule
Emp. Form.:
C16H21N5O5
Mol. Mass.:
363.3684
SMILES:
CCCC(O)C#Cc1nc(N)c2ncn(C3O[C@H](CO)[C@@H](O)[C@H]3O)c2n1
: