Target
Voltage-dependent L-type calcium channel subunit alpha-1C
Ligand
BDBM50002603
Substrate
Meas. Tech.
ChEBML_164619
IC50
3.3±n/a nM
Citation
 Sunkel, CEFau de Casa-Juana, MSantos, LGarcía, AGArtalejo, CRVillarroya, MGonzález-Morales, MALópez, MGCillero, JAlonso, S Synthesis of 3-[(2,3-dihydro-1,1,3-trioxo-1,2-benzisothiazol-2-yl)alkyl] 1,4-dihydropyridine-3,5-dicarboxylate derivatives as calcium channel modulators. J Med Chem 35:2407-14 (1992)  
Target
Name:
Voltage-dependent L-type calcium channel subunit alpha-1C
Synonyms:
CAC1C_RABIT CACN2 CACNL1A1 L-type calcium channel alpha 1C/beta 2A | Voltage-gated L-type calcium channel alpha-1C subunit
Type:
PROTEIN
Mol. Mass.:
242793.78
Organism:
Oryctolagus cuniculus
Description:
ChEMBL_42776
Residue:
2171
  
Inhibitor
Name:
BDBM50002603
Synonyms:
2,6-Dimethyl-4-(3-nitro-phenyl)-1,4-dihydro-pyridine-3,5-dicarboxylic acid 3-ethyl ester 5-(1,1,3-trioxo-1,3-dihydro-1lambda*6*-benzo[d]isothiazol-2-ylmethyl) ester | CHEMBL81326
Type:
Small organic molecule
Emp. Form.:
C25H23N3O9S
Mol. Mass.:
541.53
SMILES:
CCOC(=[OH+])C1=C(C)N=C(C)C(C1c1cccc(c1)[N+]([O-])=O)=C([O-])OCN1C(=O)c2ccccc2S1(=O)=O
: