Target
Sodium-dependent dopamine transporter
Ligand
BDBM50006786
Substrate
Meas. Tech.
ChEBML_61852
IC50
1.4±n/a nM
Citation
 Carroll, FIAbraham, PLewin, AHParham, KABoja, JWKuhar, M Isopropyl and phenyl esters of 3 beta-(4-substituted phenyl)tropan-2 beta-carboxylic acids. Potent and selective compounds for the dopamine transporter. J Med Chem 35:2497-500 (1992)  
Target
Name:
Sodium-dependent dopamine transporter
Synonyms:
DA transporter SC6A3_RAT Sodium-dependent dopamine transporter | Sodium-dependent dopamine transporter (DAT)
Type:
Multi-pass membrane protein
Mol. Mass.:
68749.45
Organism:
Rattus norvegicus (rat)
Description:
P23977
Residue:
619
  
Inhibitor
Name:
BDBM50006786
Synonyms:
3-(4-Chloro-phenyl)-8-methyl-8-aza-bicyclo[3.2.1]octane-2-carboxylic acid isopropyl ester RTI-114
Type:
Small organic molecule
Emp. Form.:
C18H24ClNO2
Mol. Mass.:
321.842
SMILES:
CC(C)OC(=O)[C@@H]1C2CC[C@H](C[C@@H]1c1ccc(Cl)cc1)N2C
: