Target
Sodium-dependent serotonin transporter
Ligand
BDBM50366564
Substrate
Meas. Tech.
ChEBML_201636
IC50
1999±n/a nM
Citation
 Carroll, FIAbraham, PLewin, AHParham, KABoja, JWKuhar, M Isopropyl and phenyl esters of 3 beta-(4-substituted phenyl)tropan-2 beta-carboxylic acids. Potent and selective compounds for the dopamine transporter. J Med Chem 35:2497-500 (1992)  
Target
Name:
Sodium-dependent serotonin transporter
Synonyms:
5-HT Transporter 5HT transporter Anandamid membrane transporter, AMT Monoamine transporters; Norepinephrine & serotonin Slc6a4 Sodium-dependent serotonin transporter (SERT) | imipramine receptor
Type:
Multi-pass membrane protein
Mol. Mass.:
70168.43
Organism:
Rattus norvegicus (rat)
Description:
P31652
Residue:
630
  
Inhibitor
Name:
BDBM50366564
Synonyms:
CHEMBL1790051 WIN-35065-2
Type:
Small organic molecule
Emp. Form.:
C16H21NO2
Mol. Mass.:
259.3434
SMILES:
COC(=O)[C@@H]1C2CC[C@H](C[C@@H]1c1ccccc1)N2C
: