Target
Cathepsin D
Ligand
BDBM50006844
Substrate
Meas. Tech.
ChEBML_44968
IC50
1250±n/a nM
Citation
 Patt, WCHamilton, HWTaylor, MDRyan, MJTaylor, DGConnolly, CJDoherty, AMKlutchko, SRSircar, ISteinbaugh, BA Structure-activity relationships of a series of 2-amino-4-thiazole-containing renin inhibitors. J Med Chem 35:2562-72 (1992)  
Target
Name:
Cathepsin D
Synonyms:
CATD_BOVIN | CTSD
Type:
PROTEIN
Mol. Mass.:
42158.92
Organism:
Bos taurus
Description:
ChEMBL_1458606
Residue:
387
  
Inhibitor
Name:
BDBM50006844
Synonyms:
(S)-N-[(S)-2-(2-Amino-thiazol-4-yl)-1-((1S,2R,3S)-1-cyclohexylmethyl-2,3-dihydroxy-5-methyl-hexylcarbamoyl)-ethyl]-2-(morpholine-4-sulfonylamino)-3-phenyl-propionamide CHEMBL34894 N-[2-(2-Amino-thiazol-4-yl)-1-(1-cyclohexylmethyl-2,3-dihydroxy-5-methyl-hexylcarbamoyl)-ethyl]-2-(morpholine-4-sulfonylamino)-3-phenyl-propionamide
Type:
Small organic molecule
Emp. Form.:
C33H52N6O7S2
Mol. Mass.:
708.932
SMILES:
CC(C)C[C@H](O)[C@H](O)[C@H](CC1CCCCC1)NC(=O)[C@H](Cc1csc(N)n1)NC(=O)[C@H](Cc1ccccc1)NS(=O)(=O)N1CCOCC1
: