Target
Polyunsaturated fatty acid 5-lipoxygenase
Ligand
BDBM50000827
Substrate
Meas. Tech.
ChEBML_3807
IC50
200±n/a nM
Citation
 Crawley, GCDowell, RIEdwards, PNFoster, SJMcMillan, RMWalker, ERWaterson, DBird, TGBruneau, PGiroaeau, JM Methoxytetrahydropyrans. A new series of selective and orally potent 5-lipoxygenase inhibitors. J Med Chem 35:2600-9 (1992)  
Target
Name:
Polyunsaturated fatty acid 5-lipoxygenase
Synonyms:
5-LO 5-Lipoxygenase (5-LO) 5-Lipoygenase ALOX5 LOG5 | LOX5_HUMAN
Type:
Enzyme
Mol. Mass.:
77972.74
Organism:
Homo sapiens (Human)
Description:
Recombinant protein was purified from E. coli lysate. After ammonium sulfate precipitation and subsequent steps, the supernatant (S100) was used for 5-LO activity assay.
Residue:
674
  
Inhibitor
Name:
BDBM50000827
Synonyms:
6-[3-Fluoro-5-(4-methoxy-tetrahydro-pyran-4-yl)-phenoxymethyl]-quinazoline | CHEMBL89849
Type:
Small organic molecule
Emp. Form.:
C21H21FN2O3
Mol. Mass.:
368.4014
SMILES:
COC1(CCOCC1)c1cc(F)cc(OCc2ccc3ncncc3c2)c1
: