Target
Polyunsaturated fatty acid 5-lipoxygenase
Ligand
BDBM50000845
Substrate
Meas. Tech.
ChEBML_3807
IC50
70±n/a nM
Citation
 Crawley, GCDowell, RIEdwards, PNFoster, SJMcMillan, RMWalker, ERWaterson, DBird, TGBruneau, PGiroaeau, JM Methoxytetrahydropyrans. A new series of selective and orally potent 5-lipoxygenase inhibitors. J Med Chem 35:2600-9 (1992)  
Target
Name:
Polyunsaturated fatty acid 5-lipoxygenase
Synonyms:
5-LO 5-Lipoxygenase (5-LO) 5-Lipoygenase ALOX5 LOG5 | LOX5_HUMAN
Type:
Enzyme
Mol. Mass.:
77972.74
Organism:
Homo sapiens (Human)
Description:
Recombinant protein was purified from E. coli lysate. After ammonium sulfate precipitation and subsequent steps, the supernatant (S100) was used for 5-LO activity assay.
Residue:
674
  
Inhibitor
Name:
BDBM50000845
Synonyms:
4-Methoxy-4-[3-(naphthalen-2-ylmethoxy)-phenyl]-tetrahydro-pyran CHEMBL88084
Type:
Small organic molecule
Emp. Form.:
C23H24O3
Mol. Mass.:
348.4349
SMILES:
COC1(CCOCC1)c1cccc(OCc2ccc3ccccc3c2)c1
: