Target
Thymidylate synthase
Ligand
BDBM50004384
Substrate
Meas. Tech.
ChEBML_209812
IC50
1900±n/a nM
Citation
 Warner, PBarker, AJJackman, ALBurrows, KDRoberts, NBishop, JAO'Connor, BMHughes, LR Quinoline antifolate thymidylate synthase inhibitors: variation of the C2- and C4-substituents. J Med Chem 35:2761-8 (1992)  
Target
Name:
Thymidylate synthase
Synonyms:
TS TYSY_MOUSE | Tyms
Type:
PROTEIN
Mol. Mass.:
34957.15
Organism:
Mus musculus
Description:
ChEMBL_1340097
Residue:
307
  
Inhibitor
Name:
BDBM50004384
Synonyms:
2-{4-[(2-Amino-4-methoxy-quinolin-6-ylmethyl)-ethyl-amino]-benzoylamino}-pentanedioic acid ; hydrate | CHEMBL92445
Type:
Small organic molecule
Emp. Form.:
C25H28N4O6
Mol. Mass.:
480.513
SMILES:
CCN(Cc1ccc2nc(N)cc(OC)c2c1)c1ccc(cc1)C(=O)N[C@@H](CCC(O)=O)C(O)=O
: