Target
Adenosine receptor A1
Ligand
BDBM50368359
Substrate
Meas. Tech.
ChEBML_29154
Ki
>472±n/a nM
Citation
 Homma, HWatanabe, YAbiru, TMurayama, TNomura, YMatsuda, A Nucleosides and nucleotides. 112. 2-(1-Hexyn-1-yl)adenosine-5'-uronamides: a new entry of selective A2 adenosine receptor agonists with potent antihypertensive activity. J Med Chem 35:2881-90 (1992)  
Target
Name:
Adenosine receptor A1
Synonyms:
AA1R_RAT ADENOSINE A1 high Adenosine A1 receptor (A1) Adenosine receptors A1 | Adora1
Type:
Protein
Mol. Mass.:
36704.13
Organism:
Rattus norvegicus (rat)
Description:
Residue:
326
  
Inhibitor
Name:
BDBM50368359
Synonyms:
2-(l-hexyn-l-yl)-adenosine-5'-N-methyluronamide (27) | CHEMBL610635
Type:
Small organic molecule
Emp. Form.:
C17H22N6O4
Mol. Mass.:
374.3944
SMILES:
CCCCC#Cc1nc(N)c2ncn(C3O[C@H](CNC=O)[C@@H](O)[C@H]3O)c2n1
: