Target
Adenosine receptor A1
Ligand
BDBM50003024
Substrate
Meas. Tech.
ChEBML_29421
Ki
3±n/a nM
Citation
 Suzuki, FShimada, JMizumoto, HKarasawa, AKubo, KNonaka, HIshii, AKawakita, T Adenosine A1 antagonists. 2. Structure-activity relationships on diuretic activities and protective effects against acute renal failure. J Med Chem 35:3066-75 (1992)  
Target
Name:
Adenosine receptor A1
Synonyms:
A1 adenosine receptor ADENOSINE A1 ADENOSINE A1 low Adenosine A1 receptor | Adenosine Receptor A1
Type:
Enzyme Catalytic Domain
Mol. Mass.:
36501.39
Organism:
GUINEA PIG
Description:
ADENOSINE A1 ADORA1 GUINEA PIG::P47745
Residue:
326
  
Inhibitor
Name:
BDBM50003024
Synonyms:
(8-(dicyclopropylmethyl)-1,3-dipropylxanthine)8-Dicyclopropylmethyl-1,3-dipropyl-3,7-dihydro-purine-2,6-dione CHEMBL84363
Type:
Small organic molecule
Emp. Form.:
C18H26N4O2
Mol. Mass.:
330.4246
SMILES:
CCCn1c2nc([nH]c2c(=O)n(CCC)c1=O)C(C1CC1)C1CC1
: