Target
Adenosine receptor A1
Ligand
BDBM50004584
Substrate
Meas. Tech.
ChEMBL_29321 (CHEMBL642309)
Ki
5.5±n/a nM
Citation
 Suzuki, FShimada, JMizumoto, HKarasawa, AKubo, KNonaka, HIshii, AKawakita, T Adenosine A1 antagonists. 2. Structure-activity relationships on diuretic activities and protective effects against acute renal failure. J Med Chem 35:3066-75 (1992)  
Target
Name:
Adenosine receptor A1
Synonyms:
AA1R_RAT ADENOSINE A1 high Adenosine A1 receptor (A1) Adenosine receptors A1 | Adora1
Type:
Protein
Mol. Mass.:
36704.13
Organism:
Rattus norvegicus (rat)
Description:
Residue:
326
  
Inhibitor
Name:
BDBM50004584
Synonyms:
(8-Chloro-1-trifluoromethyl-[1,2,4]triazolo[4,3-a]quinoxalin-4-yl)-cyclopentyl-amine | CHEMBL72669
Type:
Small organic molecule
Emp. Form.:
C15H13ClF3N5
Mol. Mass.:
355.745
SMILES:
FC(F)(F)c1nnc2c(NC3CCCC3)nc3ccc(Cl)cc3n12
: