Target
Gag-Pol polyprotein [489-587]
Ligand
BDBM50004789
Substrate
Meas. Tech.
ChEMBL_159302 (CHEMBL769355)
IC50
275±n/a nM
Citation
 DeCamp, DLBabé, LMSalto, RLucich, JLKoo, MSKahl, SBCraik, CS Specific inhibition of HIV-1 protease by boronated porphyrins. J Med Chem 35:3426-8 (1992)  
Target
Name:
Gag-Pol polyprotein [489-587]
Synonyms:
Human immunodeficiency virus type 1 protease Pol polyprotein | gag-pol
Type:
Enzyme Subunit
Mol. Mass.:
10781.16
Organism:
Human immunodeficiency virus type 1
Description:
P04585[489-587]
Residue:
99
  
Inhibitor
Name:
BDBM50004789
Synonyms:
3-[8,13-Bis-(2-acetoxy-ethyl)-18-(2-carboxy-ethyl)-3,7,12,17-tetramethyl-22,24-dihydro-porphin-2-yl]-propionic acid | CHEMBL324788
Type:
Small organic molecule
Emp. Form.:
C42H42N4O8
Mol. Mass.:
730.8049
SMILES:
Cc1c(CCC(O)=O)c2cc3nc(cc4[nH]c(cc5[nH]c(cc1n2)c(C)c5CCOC(=O)C1=CC1)c(C)c4CCOC(=O)C1=CC1)c(C)c3CCC(O)=O
: