Target
Prostaglandin G/H synthase 1/2
Ligand
BDBM50012896
Substrate
Meas. Tech.
ChEBML_158130
IC50
100±n/a nM
Citation
 Unangst, PCShrum, GPConnor, DTDyer, RDSchrier, DJ Novel 1,2,4-oxadiazoles and 1,2,4-thiadiazoles as dual 5-lipoxygenase and cyclooxygenase inhibitors. J Med Chem 35:3691-8 (1992)  
Target
Name:
Prostaglandin G/H synthase 1/2
Synonyms:
Cyclooxygenase
Type:
Mol. Mass.:
Description:
ASSAY_ID of ChEMBL is 1666355
Components:
This complex has 2 components.
Component 1
Name:
Prostaglandin G/H synthase 2
Synonyms:
Cox-2 Cyclooxygenase Ptgs2
Type:
Enzyme Catalytic Domain
Mol. Mass.:
69173.51
Organism:
RAT
Description:
COX-2 0 RAT::P35355
Residue:
604
  
Component 2
Name:
Prostaglandin G/H synthase 1
Synonyms:
Cox-1 Cyclooxygenase PGH1_RAT Ptgs1
Type:
Enzyme Catalytic Domain
Mol. Mass.:
69033.56
Organism:
RAT
Description:
COX-1 0 RAT::Q63921
Residue:
602
  
Inhibitor
Name:
BDBM50012896
Synonyms:
CHEMBL876 MECLOFENAMATE SODIUM Meclomen Sodium; 2-(2,6-dichloro-3-methyl-phenylamino)-benzoate(Fenamate series)
Type:
Small organic molecule
Emp. Form.:
C14H10Cl2NO2
Mol. Mass.:
295.141
SMILES:
Cc1ccc(Cl)c(Nc2ccccc2C([O-])=O)c1Cl
: