Target
Amine oxidase [flavin-containing] B
Ligand
BDBM50003142
Substrate
Meas. Tech.
ChEBML_123923
IC50
370±n/a nM
Citation
 Yu, PHDavis, BABoulton, AA Aliphatic propargylamines: potent, selective, irreversible monoamine oxidase B inhibitors. J Med Chem 35:3705-13 (1992)  
Target
Name:
Amine oxidase [flavin-containing] B
Synonyms:
AOFB_RAT Amine oxidase [flavin-containing] B Monoamine Oxidase Type B (MAO-B) Monoamine oxidase B (MAO-B) Monoamine oxidase type B (MAOB) | Monoamine oxidase-B (MAO-B)
Type:
Enzyme
Mol. Mass.:
58469.65
Organism:
Rattus norvegicus (rat)
Description:
P19643
Residue:
520
  
Inhibitor
Name:
BDBM50003142
Synonyms:
CHEMBL273540 | Methyl-pentyl-prop-2-ynyl-amine; oxalic acid
Type:
Small organic molecule
Emp. Form.:
C9H17N
Mol. Mass.:
139.238
SMILES:
CCCCCN(C)CC#C
: