Target
Amine oxidase [flavin-containing] A
Ligand
BDBM50003140
Substrate
Meas. Tech.
ChEBML_122940
IC50
19000±n/a nM
Citation
 Yu, PHDavis, BABoulton, AA Aliphatic propargylamines: potent, selective, irreversible monoamine oxidase B inhibitors. J Med Chem 35:3705-13 (1992)  
Target
Name:
Amine oxidase [flavin-containing] A
Synonyms:
AOFA_RAT Amine oxidase [flavin-containing] A Monoamine Oxidase Type A (MAO-A) Monoamine oxidase A (MAO-A) Monoamine oxidase type A (MAOA)
Type:
Enzyme
Mol. Mass.:
59515.21
Organism:
Rattus norvegicus (rat)
Description:
Residue:
526
  
Inhibitor
Name:
BDBM50003140
Synonyms:
CHEMBL541325 | Methyl-(1-methyl-hexyl)-prop-2-ynyl-amine; hydrochloride
Type:
Small organic molecule
Emp. Form.:
C11H21N
Mol. Mass.:
167.2911
SMILES:
CCCCCC(C)N(C)CC#C
: