Target
Carbonic anhydrase 2
Ligand
BDBM50003251
Substrate
Meas. Tech.
ChEMBL_45064 (CHEMBL659847)
Ki
8±n/a nM
Citation
 Hartman, GDHalczenko, WSmith, RLSugrue, MFMallorga, PJMichelson, SRRandall, WCSchwam, HSondey, JM 4-substituted thiophene- and furan-2-sulfonamides as topical carbonic anhydrase inhibitors. J Med Chem 35:3822-31 (1992)  
Target
Name:
Carbonic anhydrase 2
Synonyms:
CA-II CAC Carbonate dehydratase II Carbonic anhydrase 2 (CA-II) Carbonic anhydrase C Carbonic anhydrase II (CA-II) Carbonic anhydrase II (hCA II) | Carbonic anhydrase isoenzyme II (hCA II)
Type:
Enzyme
Mol. Mass.:
29250.71
Organism:
Homo sapiens (Human)
Description:
P00918
Residue:
260
  
Inhibitor
Name:
BDBM50003251
Synonyms:
4-(4-Hydroxy-benzenesulfonyl)-thiophene-2-sulfonic acid amide | CHEMBL341530
Type:
Small organic molecule
Emp. Form.:
C10H9NO5S3
Mol. Mass.:
319.377
SMILES:
NS(=O)(=O)c1cc(cs1)S(=O)(=O)c1ccc(O)cc1
: