Target
Vasopressin V1a receptor
Ligand
BDBM50001333
Substrate
Meas. Tech.
ChEBML_211234
IC50
510±n/a nM
Citation
 Williams, PDBock, MGTung, RDGarsky, VMPerlow, DSErb, JMLundell, GFGould, NPWhitter, WLHoffman, JB Development of a novel class of cyclic hexapeptide oxytocin antagonists based on a natural product. J Med Chem 35:3905-18 (1992)  
Target
Name:
Vasopressin V1a receptor
Synonyms:
Avpr1a VASOPRESSIN V1A Vasopressin V1a receptor | Vasopressin receptor
Type:
Enzyme Catalytic Domain
Mol. Mass.:
47674.81
Organism:
RAT
Description:
VASOPRESSIN V1A AVPR1A RAT::P30560
Residue:
424
  
Inhibitor
Name:
BDBM50001333
Synonyms:
18-(4-Amino-butyl)-15-benzyl-3-sec-butyl-16-methyl-6-naphthalen-1-ylmethyl-1,4,7,13,16,19-hexaaza-tricyclo[19.4.0.0*9,13*]pentacosane-2,5,8,14,17,20-hexaone | CHEMBL340204
Type:
Small organic molecule
Emp. Form.:
C46H61N7O6
Mol. Mass.:
808.0198
SMILES:
CC[C@H](C)[C@@H]1NC(=O)[C@@H](Cc2cccc3ccccc23)NC(=O)[C@@H]2CCCN2C(=O)[C@@H](Cc2ccccc2)N(C)C(=O)[C@H](CCCCN)NC(=O)[C@H]2CCCCN2C1=O
: